{"text_format":"1","workbook":"xlsx","n_sheets":17,"sheets":["macro","הזנת נתונים","חישוב פטור בגיל פרישה","נתונים ותקרות","חוב וותק פיצויים","תקופות עבודה רצפים","חישוב פיצויים שנמשכו ב-32 ש\"ע","היוון קיצבה","מענקי פיצויים","חישובי קיצבה ","כדאיות כלכלית קיצבה מול פיצויים","פירוט הכדאיות","מדד המחירים לצרכן ומדד הביטוח","מס על הקיצבה","מס על הקיצבה 2","מס על הקיצבה+פיצויים","מס על הקיצבה+פיצויים+היוון"],"not_rendered":{"charts":0,"images":0,"macros":1,"external_links":1,"defined_names":8,"comments":0,"pivot_tables":0},"unopened":[],"bounds":{"document_bytes":16777216,"sheet_cells":100000,"rows_first":2000,"rows_last":500,"rows_between":2000,"halvings":0,"cell_chars":16384,"cell_head_chars":4096},"cells_cut":0,"cells_raw":0,"read":"whole","date_system":"1900"}

{"sheet":"macro","index":0,"n_rows":0,"n_cols":0,"rows_kept":0,"cut":false,"hidden":false,"merged":[]}

{"sheet":"הזנת נתונים","index":1,"n_rows":25,"n_cols":9,"rows_kept":25,"cut":false,"hidden":true,"merged":[[12,0,13,1],[2,5,5,6],[24,5,25,5],[24,6,25,6]]}
[]
["נא להזין תאריכים",null,null,null,null,"נא להזין סכומים להיוון"]
["תאריך תחילת עבודה","1985-01-01",null,null,null,"יש להזין חיסכון למטרת קצבה שהלקוח מעוניין להוון בפרישה, במידה וישנם בתוכנית תגמולים ופיצויים חובה לפחות יחס של 1.2 תגמולים ל-1 פיצויים."]
["תאריך סיום עבודה","2020-12-31"]
[]
[]
["נתוני הכנסות ותשלומי מס בשנת הפרישה",null,null,null,null,"סכומי חיסכון למטרת קצבה שהלקוח מעוניין להוון",45678]
["הכנסות מעבודה בשנת הפרישה",254000]
["מס ששולם בשנת הפרישה",60000]
["נקודות זיכוי",2.25]
{"$rows_left_out":16}
{"sheet":"חישוב פטור בגיל פרישה","index":2,"n_rows":41,"n_cols":17,"rows_kept":41,"cut":false,"hidden":true,"merged":[]}
[]
[]
[]
[null,null,null,null,null,null,null,null,"תאריך",{"$f":"NOW()","v":"2021-04-05T15:26:12.610"},null,"התפתחות הפטור","מקסימום","מינימום",null,null,1]
["תקופת עבודה לחישוב פטור",{"$f":"'תקופות עבודה רצפים'!E23","v":36.021917808219179},{"$f":"IF(B5>32,\"הגדלת פטור\",\"מצב קיים\")","v":"הגדלת פטור"},"חודש הפרישה",{"$f":"IF(DAY(J18)>10,MONTH(J18)+1,MONTH(J18))","v":13},null,null,null,"תקרה מזכה",{"$f":"'נתונים ותקרות'!B4","v":8460},null,2017,0.49,0.14000000000000001,null,null,2]
["פטור לכל שנת עבודה בהתאם לפקודת מס הכנסה",{"$f":"J8","v":12340},null,null,null,null,null,null,"פטור מינמילי",{"$f":"J5*J10","v":1438.2},null,2020,0.52,0.17,null,null,3]
["סה\"כ פיצויים פטורים בהתאם לפקודה",{"$f":"B5*B6","v":444510.46575342468},null,null,null,null,null,null,"אפס",0,null,2025,0.67,0.32,null,null,4]
[null,null,null,null,null,null,null,null,"פטור פיצויים לכל שנת עבודה",{"$f":"'נתונים ותקרות'!B5","v":12340},null,null,null,null,null,null,5]
["התחשבנות פיצויים",null,null,null,null,null,null,null,"אחוז פטור",{"$f":"IF(YEAR(J18)<L6,M5,IF(YEAR(J18)<L7,M6,M7))","v":0.52},null,null,null,null,null,null,6]
["משיכת פיצויים בעבר",{"$f":"'חישוב פיצויים שנמשכו ב-32 ש\"ע'!G20","v":37156.758554630505},null,"פריסת מס בגין פיצויים",null,null,null,null,"אחוז פטור מינימלי",{"$f":"IF(YEAR(J18)<L6,N5,IF(YEAR(J18)<L7,N6,N7))","v":0.17},null,null,null,null,null,null,7]
{"$rows_left_out":32}
{"sheet":"נתונים ותקרות","index":3,"n_rows":24,"n_cols":2,"rows_kept":24,"cut":false,"hidden":true,"merged":[]}
[]
[]
["מדד התחשבנות",12389]
["תקרה מזכה",8460]
["פטור פיצויים לכל שנת עבודה",12340]
["שווי נקודת זיכוי",218]
[]
[]
[]
[]
{"$rows_left_out":15}
{"sheet":"חוב וותק פיצויים","index":4,"n_rows":30,"n_cols":4,"rows_kept":30,"cut":false,"hidden":true,"merged":[[25,0,26,0]]}
[]
[]
["מעסיק אחרון"]
["חישוב חוב וותק פיצויים"]
[]
[null,null,"תאריך סיום עבודה","תאריך תחילת עבודה"]
["תקופת עבודה",{"$f":"(C7-D7)/365","v":36.021917808219179},{"$f":"'הזנת נתונים'!B4","v":"2020-12-31"},{"$f":"'הזנת נתונים'!B3","v":"1985-01-01"}]
["שכר אחרון"]
["חוב וותק",{"$f":"B7*B8","v":0}]
[]
{"$rows_left_out":21}
{"sheet":"תקופות עבודה רצפים","index":5,"n_rows":23,"n_cols":13,"rows_kept":23,"cut":false,"hidden":true,"merged":[[22,0,22,3]]}
[]
[]
[]
["מס\"ד","מעסיק","תחילת עבודה","סיום עבודה","סה\"כ תקופת עבודה","רצף פיצויים","רצף","תקופת עבודה לחישוב הפטור"]
[1,"א",{"$f":"'חוב וותק פיצויים'!D7","v":"1985-01-01"},{"$f":"'חוב וותק פיצויים'!C7","v":"2020-12-31"},{"$f":"(D5-C5)/365","v":36.021917808219179},"מעסיק אחרון",{"$f":"AND(OR(F5=\"כן\",F5=0,F5=\"מעסיק אחרון\"),OR(F6=\"כן\",F6=0,F6=\"מעסיק אחרון\"),OR(F7=\"כן\",F7=0,F7=\"מעסיק אחרון\"),OR(F8=\"כן\",F8=0,F8=\"מעסיק אחרון\"),OR(F9=\"כן\",F9=0,F9=\"מעסיק אחרון\"),OR(F10=\"כן\",F10=0,F10=\"מעסיק אחרון\"),OR(F11=\"כן\",F11=0,F11=\"מעסיק אחרון\"),OR(F12=\"כן\",F12=0,F12=\"מעסיק אחרון\"),OR(F13=\"כן\",F13=0,F13=\"מעסיק אחרון\"),OR(F14=\"כן\",F14=0,F14=\"מעסיק אחרון\"),OR(F15=\"כן\",F15=0,F15=\"מעסיק אחרון\"),OR(F16=\"כן\",F16=0,F16=\"מעסיק אחרון\"),OR(F17=\"כן\",F17=0,F17=\"מעסיק אחרון\"),OR(F18=\"כן\",F18=0,F18=\"מעסיק אחרון\"),OR(F19=\"כן\",F19=0,F19=\"מעסיק אחרון\"))","v":true},{"$f":"IF(G5=TRUE,TRUE,FALSE)","v":true}]
[2,"ב",null,null,{"$f":"(D6-C6)/365","v":0},0,{"$f":"AND(OR(F6=\"כן\",F6=0,F6=\"מעסיק אחרון\"),OR(F7=\"כן\",F7=0,F7=\"מעסיק אחרון\"),OR(F8=\"כן\",F8=0,F8=\"מעסיק אחרון\"),OR(F9=\"כן\",F9=0,F9=\"מעסיק אחרון\"),OR(F10=\"כן\",F10=0,F10=\"מעסיק אחרון\"),OR(F11=\"כן\",F11=0,F11=\"מעסיק אחרון\"),OR(F12=\"כן\",F12=0,F12=\"מעסיק אחרון\"),OR(F13=\"כן\",F13=0,F13=\"מעסיק אחרון\"),OR(F14=\"כן\",F14=0,F14=\"מעסיק אחרון\"),OR(F15=\"כן\",F15=0,F15=\"מעסיק אחרון\"),OR(F16=\"כן\",F16=0,F16=\"מעסיק אחרון\"),OR(F17=\"כן\",F17=0,F17=\"מעסיק אחרון\"),OR(F18=\"כן\",F18=0,F18=\"מעסיק אחרון\"),OR(F19=\"כן\",F19=0,F19=\"מעסיק אחרון\"),OR(F20=\"כן\",F20=0,F20=\"מעסיק אחרון\"))","v":true},{"$f":"IF(G6=TRUE,TRUE,FALSE)","v":true},null,null,null,null,"כן"]
[3,"ג",null,null,{"$f":"(D7-C7)/365","v":0},0,true,true,null,null,null,null,"לא"]
[4,"ד",null,null,0,0,true,true,null,null,null,null,"מעסיק אחרון"]
[5,"ה",null,null,0,0,true,true,null,null,null,null,0]
[6,"ו",null,null,null,0,true,true]
{"$rows_left_out":14}
{"sheet":"חישוב פיצויים שנמשכו ב-32 ש\"ע","index":6,"n_rows":20,"n_cols":11,"rows_kept":20,"cut":false,"hidden":true,"merged":[[19,3,19,5]]}
[]
[null,null,"תאריך הפרישה",{"$f":"'חוב וותק פיצויים'!C7","v":"2020-12-31"},null,"מדד התחשבנות",{"$f":"'נתונים ותקרות'!B3","v":12389}]
[]
["מס\"ד","מעסיק","סכום הפיצויים","תאריך משיכה - חודש ושנה בלבד","מדד משיכה","מדד התחשבנות","שווי נכון ליום ההתחשבנות",null,null,"מבצע בדיקת 32 שנות עבודה"]
[1,{"$f":"'תקופות עבודה רצפים'!B5","v":"א"},{"$f":"'הזנת נתונים'!A16","v":10000},{"$f":"'הזנת נתונים'!B16","v":"1972-12-01"},{"$f":"IF(C5>0,VLOOKUP(D5,'מדד המחירים לצרכן ומדד הביטוח'!D5:E1000,2,FALSE),0)","v":230.61},{"$f":"$G$2","v":12389},{"$f":"IF((YEAR($D$2)-YEAR(D5))<=32,C5*$G$2/E5,0)","v":0}]
[2,{"$f":"'תקופות עבודה רצפים'!B6","v":"ב"},{"$f":"'הזנת נתונים'!A17","v":20000},{"$f":"'הזנת נתונים'!B17","v":"2010-11-01"},{"$f":"IF(C6>0,VLOOKUP(D6,'מדד המחירים לצרכן ומדד הביטוח'!D6:E1001,2,FALSE),0)","v":11621},{"$f":"$G$2","v":12389},{"$f":"IF((YEAR($D$2)-YEAR(D6))<=32,C6*$G$2/E6,0)","v":21321.745116599261}]
[3,{"$f":"'תקופות עבודה רצפים'!B7","v":"ג"},{"$f":"'הזנת נתונים'!A18","v":15789},{"$f":"'הזנת נתונים'!B18","v":"2020-12-01"},{"$f":"IF(C7>0,VLOOKUP(D7,'מדד המחירים לצרכן ומדד הביטוח'!D7:E1002,2,FALSE),0)","v":12353},12389,15835.013438031248]
[4,{"$f":"'תקופות עבודה רצפים'!B8","v":"ד"},{"$f":"'הזנת נתונים'!A19","v":0},{"$f":"'הזנת נתונים'!B19","v":"00:00:00"},{"$f":"IF(C8>0,VLOOKUP(D8,'מדד המחירים לצרכן ומדד הביטוח'!D8:E1003,2,FALSE),0)","v":0},12389,0]
[5,{"$f":"'תקופות עבודה רצפים'!B9","v":"ה"},{"$f":"'הזנת נתונים'!A20","v":0},{"$f":"'הזנת נתונים'!B20","v":"00:00:00"},{"$f":"IF(C9>0,VLOOKUP(D9,'מדד המחירים לצרכן ומדד הביטוח'!D9:E1004,2,FALSE),0)","v":0},12389,0]
[6,{"$f":"'תקופות עבודה רצפים'!B10","v":"ו"},{"$f":"'הזנת נתונים'!A21","v":0},{"$f":"'הזנת נתונים'!B21","v":"00:00:00"},{"$f":"IF(C10>0,VLOOKUP(D10,'מדד המחירים לצרכן ומדד הביטוח'!D10:E1005,2,FALSE),0)","v":0},12389,0]
{"$rows_left_out":11}
{"sheet":"היוון קיצבה","index":7,"n_rows":20,"n_cols":8,"rows_kept":20,"cut":false,"hidden":true,"merged":[]}
[]
["היוון קיצבאות"]
[]
["מס\"ד","מספר עמית","חברה מנהלת","סוג קופה","סכום להיוון"]
[1,null,null,"קופת גמל",{"$f":"'הזנת נתונים'!G7","v":45678},null,null,"סוגי קופות"]
[2,null,null,null,null,null,null,"קופת גמל"]
[3,null,null,null,null,null,null,"ביטוח מנהלים"]
[4,null,null,null,null,null,null,"קרן פנסיה"]
[5]
[6]
{"$rows_left_out":11}
{"sheet":"מענקי פיצויים","index":8,"n_rows":33,"n_cols":13,"rows_kept":33,"cut":false,"hidden":true,"merged":[[31,0,31,1]]}
[]
[null,"תאריך הפרישה",{"$f":"'חישוב פיצויים שנמשכו ב-32 ש\"ע'!D2","v":"2020-12-31"}]
[]
["מס\"ד","שם המשלם","מספר תיק ניכויים","קוד סוג המשלם","קוד סוג התשלום","סכום המענק","האם נמשך במזומן","מספר פוליסה","רצף קיצבה","רצף פיצויים",null,{"$f":"D4","v":"קוד סוג המשלם"}]
[1,"מגדל ביטוח",9356000359,4,20,null,"כן",null,"לא","לא",null,"המעביד",1]
[2,"מנורה מבטחים פנסיה",9359689784,6,20,null,"לא",null,"כן","לא",null,"מינהל הגמלאות (פנסיה תקציבית של עובדי מדינה)",2]
[3,null,null,null,null,null,null,null,null,null,null,"קופה מרכזית לפיצויים, כולל ביטוח לאומי במקרה של פשיטת רגל",3]
[4,null,null,null,null,null,null,null,null,null,null,"קופה אישית לפיצויים כולל קופת ביטוח (הון)",4]
[5,null,null,null,null,null,null,null,null,null,null,"קופת פנסיה וותיקה",5]
[6,null,null,null,null,null,null,null,null,null,null,"קופת פנסיה חדשה כולל קופת ביטוח לקיצבה",6]
{"$rows_left_out":24}
{"sheet":"חישובי קיצבה ","index":9,"n_rows":33,"n_cols":8,"rows_kept":33,"cut":false,"hidden":true,"merged":[[15,0,15,6],[32,0,32,6],[17,4,17,6]]}
[]
[]
[null,"מקורות קיצבה מזכה"]
[]
["מס\"ד","מספר פוליסה","חברת ביטוח","צבירת תגמולים לקיצבה","צבירת פיצויים לקיצבה","סה\"כ","מקדם","סה\"כ קיצבה"]
[1,123456,"מגדל",2000000,null,1500000,200]
[2,789005,"כלל",null,null,{"$f":"E7+D7","v":0},137.69999999999999]
[3]
[4]
[5]
{"$rows_left_out":24}
{"sheet":"כדאיות כלכלית קיצבה מול פיצויים","index":10,"n_rows":49,"n_cols":17,"rows_kept":49,"cut":false,"hidden":true,"merged":[]}
[]
[]
[]
[null,null,null,null,null,null,null,null,"תאריך",{"$f":"NOW()","v":"2021-04-05T15:26:12.610"},null,"התפתחות הפטור","מקסימום","מינימום",null,null,1]
["תקופת עבודה לחישוב פטור",{"$f":"'תקופות עבודה רצפים'!E23","v":36.021917808219179},{"$f":"IF(B5>32,\"הגדלת פטור\",\"מצב קיים\")","v":"הגדלת פטור"},"חודש הפרישה",{"$f":"IF(DAY(J18)>10,MONTH(J18)+1,MONTH(J18))","v":13},null,null,null,"תקרה מזכה",{"$f":"'נתונים ותקרות'!B4","v":8460},null,2017,0.49,0.14000000000000001,null,null,2]
["פטור לכל שנת עבודה בהתאם לפקודת מס הכנסה",{"$f":"J8","v":12340},null,null,null,null,null,null,"פטור מינמילי",{"$f":"J5*J10","v":1438.2},null,2020,0.52,0.17,null,null,3]
["סה\"כ פיצויים פטורים בהתאם לפקודה",{"$f":"B5*B6","v":444510.46575342468},null,null,null,null,null,null,"אפס",0,null,2025,0.67,0.32,null,null,4]
[null,null,null,null,null,null,null,null,"פטור פיצויים לכל שנת עבודה",{"$f":"'נתונים ותקרות'!B5","v":12340},null,null,null,null,null,null,5]
["התחשבנות פיצויים",null,null,null,null,null,null,null,"אחוז פטור",{"$f":"IF(YEAR(J18)<L6,M5,IF(YEAR(J18)<L7,M6,M7))","v":0.52},null,null,null,null,null,null,6]
["משיכת פיצויים בעבר",{"$f":"'חישוב פיצויים שנמשכו ב-32 ש\"ע'!G20","v":37156.758554630505},null,"פריסת מס בגין פיצויים",null,null,null,null,"אחוז פטור מינימלי",{"$f":"IF(YEAR(J18)<L6,N5,IF(YEAR(J18)<L7,N6,N7))","v":0.17},null,null,null,null,null,null,7]
{"$rows_left_out":40}
{"sheet":"פירוט הכדאיות","index":11,"n_rows":35,"n_cols":6,"rows_kept":35,"cut":false,"hidden":true,"merged":[]}
[]
[]
["שנה","גיל","סה\"כ הכנסות נטו בהמרת פיצווים לקיצבה","סה\"כ הכנסות נטו במשיכת פיצויים כמענק","הפרש","יתרון"]
[{"$f":"'חישוב פטור בגיל פרישה'!D13","v":2021},{"$f":"A4-YEAR('חישוב פטור בגיל פרישה'!$J$22)","v":121},{"$f":"(12-'חישוב פטור בגיל פרישה'!$E$5)*'חישוב פטור בגיל פרישה'!$C$31+'חישוב פטור בגיל פרישה'!$B$37","v":796685.53415525123},{"$f":"(12-'כדאיות כלכלית קיצבה מול פיצויים'!$E$5)*'כדאיות כלכלית קיצבה מול פיצויים'!$C$39+'כדאיות כלכלית קיצבה מול פיצויים'!$B$45","v":-10890.298995433826},{"$f":"C4-D4","v":807575.83315068507},{"$f":"IF(E4<0,\"יתרון למשיכת פיצויים כמענק\",\"יתרון למשיכת פיצויים כקיצבה\")","v":"יתרון למשיכת פיצויים כקיצבה"}]
[{"$f":"A4+1","v":2022},{"$f":"A5-YEAR('חישוב פטור בגיל פרישה'!$J$22)","v":122},{"$f":"C4+'חישוב פטור בגיל פרישה'!$B$31*12","v":910780.58215525118},{"$f":"12*'כדאיות כלכלית קיצבה מול פיצויים'!$B$39+D4","v":-28019.098995433829},{"$f":"C5-D5","v":938799.68115068506},{"$f":"IF(E5<0,\"יתרון למשיכת פיצויים כמענק\",\"יתרון למשיכת פיצויים כקיצבה\")","v":"יתרון למשיכת פיצויים כקיצבה"}]
[{"$f":"A5+1","v":2023},{"$f":"A6-YEAR('חישוב פטור בגיל פרישה'!$J$22)","v":123},{"$f":"C5+'חישוב פטור בגיל פרישה'!$B$31*12","v":1024875.6301552511},{"$f":"12*'כדאיות כלכלית קיצבה מול פיצויים'!$B$39+D5","v":-45147.898995433832},1070023.5291506851,"יתרון למשיכת פיצויים כקיצבה"]
[2024,{"$f":"A7-YEAR('חישוב פטור בגיל פרישה'!$J$22)","v":124},{"$f":"C6+'חישוב פטור בגיל פרישה'!$B$31*12","v":1138970.6781552511},{"$f":"12*'כדאיות כלכלית קיצבה מול פיצויים'!$B$39+D6","v":-62276.698995433835},1201247.3771506848,"יתרון למשיכת פיצויים כקיצבה"]
[2025,{"$f":"A8-YEAR('חישוב פטור בגיל פרישה'!$J$22)","v":125},{"$f":"C7+'חישוב פטור בגיל פרישה'!$B$31*12","v":1253065.726155251},{"$f":"12*'כדאיות כלכלית קיצבה מול פיצויים'!$B$39+D7","v":-79405.498995433838},1332471.2251506848,"יתרון למשיכת פיצויים כקיצבה"]
[2026,{"$f":"A9-YEAR('חישוב פטור בגיל פרישה'!$J$22)","v":126},{"$f":"C8+'חישוב פטור בגיל פרישה'!$B$31*12","v":1367160.774155251},{"$f":"12*'כדאיות כלכלית קיצבה מול פיצויים'!$B$39+D8","v":-96534.298995433841},1463695.0731506848,"יתרון למשיכת פיצויים כקיצבה"]
[2027,{"$f":"A10-YEAR('חישוב פטור בגיל פרישה'!$J$22)","v":127},{"$f":"C9+'חישוב פטור בגיל פרישה'!$B$31*12","v":1481255.8221552509},{"$f":"12*'כדאיות כלכלית קיצבה מול פיצויים'!$B$39+D9","v":-113663.09899543384},1594918.9211506848,"יתרון למשיכת פיצויים כקיצבה"]
{"$rows_left_out":26}
{"sheet":"מדד המחירים לצרכן ומדד הביטוח","index":12,"n_rows":837,"n_cols":6,"rows_kept":837,"cut":false,"hidden":true,"merged":[[0,0,0,5],[1,0,1,2],[1,3,1,5],[2,0,2,2],[2,3,2,5]]}
["מדד המחירים לצרכן ומדד ביטוח חיים"]
["מדד המחירים לצרכן",null,null,"מדד ביטוח חיים"]
["על בסיס ספטמבר 1951 = 100 נקודות",null,null,"המדד האחרון הידוע ב-1 לכל חודש. המדד הבסיסי מותאם למדד חודש ינואר 1959 (100 נקודות). המדד מתרגם את חילופי המטבעות (מל\"י לשקל ולש\"ח)"]
["מדד בגין חודש","המדד בנקודות","פורסם בתאריך","חודש","המדד בנקודות","מדד בסיס 1959 ללא עיגול וללא המרת מטבע"]
["1951-09-01",100,"1951-10-15","1951-11-01"]
["1951-10-01",103,"1951-11-15","1951-12-01"]
["1951-11-01",105,"1951-12-16","1952-01-01"]
["1951-12-01",107,"1952-01-15","1952-02-01"]
["1952-01-01",113,"1952-02-15","1952-03-01"]
["1952-02-01",120,"1952-03-16","1952-04-01"]
{"$rows_left_out":828}
{"sheet":"מס על הקיצבה","index":13,"n_rows":37,"n_cols":12,"rows_kept":37,"cut":false,"hidden":true,"merged":[[5,1,5,2],[5,3,5,4],[24,2,24,3],[30,2,30,3],[36,2,36,3]]}
[]
["חישוב מס בשנים שלאחר שנת הפרישה"]
[]
[]
["חישוב מס",null,null,null,null,null,null,null,null,null,"שווי נקודת זיכוי",{"$f":"'נתונים ותקרות'!$B$6","v":218}]
["קיצבה ברוטו","קיצבה+ שכר בפריסה",null,"מס"]
[null,"חודשי","שנתי","מס שנתי","מס חודשי",null,null,null,null,null,"רווק",2.25]
["קיצבה ברוטו בניכוי פטור",{"$f":"IF('חישוב פטור בגיל פרישה'!B27=0,'חישוב פטור בגיל פרישה'!B29,'חישוב פטור בגיל פרישה'!B29-'חישוב פטור בגיל פרישה'!B27)","v":8815.5666666666657},{"$f":"12*B8","v":105786.79999999999},{"$f":"E8*12","v":5904.9519999999993},{"$f":"E25","v":492.07933333333324},null,null,null,null,null,"נשוי ללא ילדים",{"$f":"L7","v":2.25}]
["קיצבה ברוטו + פריסת מס פיצויים",{"$f":"'חישוב פטור בגיל פרישה'!E13/12+'מס על הקיצבה'!B8","v":15519.587975646878},{"$f":"12*B9","v":186235.05570776254},{"$f":"E9*12","v":23199.267269406384},{"$f":"E31","v":1933.272272450532},null,null,null,null,null,"אלמן/גרוש ללא ילדים",{"$f":"L8","v":2.25}]
["קיצבה ברוטו + פריסת מס פיצויים ופריסת מס היוון",{"$f":"'חישוב פטור בגיל פרישה'!E27/12+B9","v":15519.587975646878},186235.05570776254,23199.267269406384,{"$f":"E37","v":1933.272272450532},null,null,null,null,null,"נשוי בן 70 ומעלה שבת זוגו אינה עובדת",3.25]
{"$rows_left_out":28}
{"sheet":"מס על הקיצבה 2","index":14,"n_rows":27,"n_cols":12,"rows_kept":27,"cut":false,"hidden":true,"merged":[[5,1,5,2],[5,3,5,4],[24,2,24,3]]}
[]
[]
[]
[]
["חישוב מס בשנת הפרישה",null,null,null,null,null,null,null,null,null,"שווי נקודת זיכוי",{"$f":"'נתונים ותקרות'!$B$6","v":218}]
["קיצבה ברוטו","קיצבה+ שכר בפריסה",null,"מס"]
[null,"חודשי","שנתי","מס שנתי","מס חודשי",null,null,null,null,null,"רווק",2.25]
["קיצבה ברוטו בניכוי פטור + שכר בשנת הפרישה",{"$f":"A23","v":21166.666666666668},{"$f":"12*B8","v":254000},{"$f":"E8*12","v":44699.199999999997},{"$f":"E25","v":3724.9333333333334},null,null,null,null,null,"נשוי ללא ילדים",{"$f":"L7","v":2.25}]
["קיצבה ברוטו + פריסת מס פיצויים",{"$f":"B8+'חישוב פטור בגיל פרישה'!E13/12","v":27870.687975646881},{"$f":"12*B9","v":334448.25570776255},{"$f":"E9*12","v":78742.089497716894},{"$f":"IF(A23=0,'מס על הקיצבה+פיצויים'!E19,'מס על הקיצבה+פיצויים'!E19-'מס על הקיצבה 2'!E24)","v":6561.8407914764084},null,null,null,null,null,"אלמן/גרוש ללא ילדים",{"$f":"L8","v":2.25}]
["קיצבה ברוטו + פריסת מס פיצויים ופריסת מס היוון",{"$f":"B9+'חישוב פטור בגיל פרישה'!E27/12","v":27870.687975646881},{"$f":"12*B10","v":334448.25570776255},78742.089497716894,{"$f":"IF(AND(A23=0,'מס על הקיצבה+פיצויים'!A17=0),'מס על הקיצבה+פיצויים+היוון'!E19,'מס על הקיצבה+פיצויים+היוון'!E17)","v":6561.8407914764084},null,null,null,null,null,"נשוי בן 70 ומעלה שבת זוגו אינה עובדת",3.25]
{"$rows_left_out":18}
{"sheet":"מס על הקיצבה+פיצויים","index":15,"n_rows":27,"n_cols":12,"rows_kept":27,"cut":false,"hidden":true,"merged":[[18,2,18,3]]}
[]
[]
[]
[]
[null,null,null,null,null,null,null,null,null,null,"שווי נקודת זיכוי",{"$f":"'נתונים ותקרות'!$B$6","v":218}]
[]
[null,"שיעור מס","הכנסה חודשית","סכום במדרגה","סכום מצטבר",null,null,null,null,null,"רווק",2.25]
[1,0.1,{"$f":"'נתונים ותקרות'!B17","v":0},0,0,null,null,null,null,null,"נשוי ללא ילדים",{"$f":"L7","v":2.25}]
[2,0.14000000000000001,{"$f":"'נתונים ותקרות'!B18","v":6290},{"$f":"B8*C9","v":629},{"$f":"E8+D9","v":629},null,null,null,null,null,"אלמן/גרוש ללא ילדים",{"$f":"L8","v":2.25}]
[3,0.2,{"$f":"'נתונים ותקרות'!B19","v":9030},{"$f":"(C10-C9)*B9","v":383.6},{"$f":"E9+D10","v":1012.6},null,null,null,null,null,"נשוי בן 70 ומעלה שבת זוגו אינה עובדת",3.25]
{"$rows_left_out":18}
{"sheet":"מס על הקיצבה+פיצויים+היוון","index":16,"n_rows":27,"n_cols":12,"rows_kept":27,"cut":false,"hidden":true,"merged":[[18,2,18,3]]}
[]
[]
[]
[]
[null,null,null,null,null,null,null,null,null,null,"שווי נקודת זיכוי",{"$f":"'נתונים ותקרות'!$B$6","v":218}]
[]
[null,"שיעור מס","הכנסה חודשית","סכום במדרגה","סכום מצטבר",null,null,null,null,null,"רווק",2.25]
[1,0.1,{"$f":"'נתונים ותקרות'!B17","v":0},0,0,null,null,null,null,null,"נשוי ללא ילדים",{"$f":"L7","v":2.25}]
[2,0.14000000000000001,{"$f":"'נתונים ותקרות'!B18","v":6290},{"$f":"B8*C9","v":629},{"$f":"E8+D9","v":629},null,null,null,null,null,"אלמן/גרוש ללא ילדים",{"$f":"L8","v":2.25}]
[3,0.2,{"$f":"'נתונים ותקרות'!B19","v":9030},{"$f":"(C10-C9)*B9","v":383.6},{"$f":"E9+D10","v":1012.6},null,null,null,null,null,"נשוי בן 70 ומעלה שבת זוגו אינה עובדת",3.25]
{"$rows_left_out":17}